練功房推薦書單

  • 猛虎出柙雙劍合璧版:最新 OCA / OCP Java SE 7 Programmer 專業認證
  • 流浪教師存零股存到3000萬
  • SCJP 6.0認證教戰手冊(第二版)Oracle Certified Professional Java Programmer(附光碟)
  • 小資女艾蜜莉:我的資產翻倍存股筆記
请指示错误 谢谢...  RSS feed
討論區首頁 » JForum中文社群 JForum Chinese Users Community
發表人 內容
shun

十級學員

註冊時間: 2013-09-23 10:28:23
文章: 6
離線
[INFO] Scanning for projects...
[INFO]                                                                         
[INFO] ------------------------------------------------------------------------
[INFO] Building JForum 2.3.5-snapshot
[INFO] ------------------------------------------------------------------------
[INFO] ------------------------------------------------------------------------
[INFO] BUILD FAILURE
[INFO] ------------------------------------------------------------------------
[INFO] Total time: 0.157s
[INFO] Finished at: Mon Sep 23 17:32:32 CST 2013
[INFO] Final Memory: 1M/15M
[INFO] ------------------------------------------------------------------------
[ERROR] Unknown lifecycle phase "maven". You must specify a valid lifecycle phase or a goal in the format <plugin-prefix>:<goal> or <plugin-group-id>:<plugin-artifact-id>[:<plugin-version>]:<goal>. Available lifecycle phases are: validate, initialize, generate-sources, process-sources, generate-resources, process-resources, compile, process-classes, generate-test-sources, process-test-sources, generate-test-resources, process-test-resources, test-compile, process-test-classes, test, prepare-package, package, pre-integration-test, integration-test, post-integration-test, verify, install, deploy, pre-site, site, post-site, site-deploy, pre-clean, clean, post-clean. -> [Help 1]
[ERROR] 
[ERROR] To see the full stack trace of the errors, re-run Maven with the -e switch.
[ERROR] Re-run Maven using the -X switch to enable full debug logging.
[ERROR] 
[ERROR] For more information about the errors and possible solutions, please read the following articles:
[ERROR] [Help 1] http://cwiki.apache.org/confluence/display/MAVEN/LifecyclePhaseNotFoundException
shun

十級學員

註冊時間: 2013-09-23 10:28:23
文章: 6
離線
Downloaded: http://repo1.maven.org/maven2/com/thoughtworks/xstream/xstream/1.4.3/xstream-1.4.3.jar (471 KB at 191.7 KB/sec)
Downloaded: http://repo1.maven.org/maven2/org/codehaus/plexus/plexus-utils/3.0.8/plexus-utils-3.0.8.jar (227 KB at 146.2 KB/sec)
[INFO] Packaging webapp
[INFO] Assembling webapp [jforum] in [C:\Users\shun\workspace\iforum\target\jforum]
[INFO] Processing war project
[INFO] Copying webapp webResources [C:\Users\shun\workspace\iforum\.] to [C:\Users\shun\workspace\iforum\target\jforum]
[INFO] Copying webapp resources [C:\Users\shun\workspace\iforum\src\main\webapp]
[INFO] Building jar: C:\Users\shun\workspace\iforum\target\jforum\WEB-INF\lib\jforum-2.3.5-snapshot.jar
[INFO] Webapp assembled in [8635 msecs]
[INFO] Building war: C:\Users\shun\workspace\iforum\target\jforum.war
[INFO]
[INFO] --- maven-install-plugin:2.3.1:install (default-install) @ jforum ---
[INFO] Installing C:\Users\shun\workspace\iforum\target\jforum.war to C:\Users\shun\.m2\repository\net\jforum\jforum\2.3.5-snapshot\jforum-2.3.5-snapshot.war
[INFO] Installing C:\Users\shun\workspace\iforum\pom.xml to C:\Users\shun\.m2\repository\net\jforum\jforum\2.3.5-snapshot\jforum-2.3.5-snapshot.pom
[INFO] ------------------------------------------------------------------------
[INFO] BUILD SUCCESS
[INFO] ------------------------------------------------------------------------
[INFO] Total time: 37.668s
[INFO] Finished at: Mon Sep 23 20:46:17 CST 2013
[INFO] Final Memory: 7M/17M
[INFO] ------------------------------------------------------------------------

问题已解决...
 
討論區首頁 » JForum中文社群 JForum Chinese Users Community
前往: